{"text_format":"1","workbook":"xlsx","n_sheets":7,"sheets":["DASHBOARD","HOW TO USE","TRAINING SPECS","PLAN","DATA","GOAL TRACKING","VISUALS"],"not_rendered":{"charts":6,"images":0,"macros":1,"external_links":0,"defined_names":5,"comments":0,"pivot_tables":0},"unopened":[],"bounds":{"document_bytes":16777216,"sheet_cells":100000,"rows_first":2000,"rows_last":500,"rows_between":2000,"halvings":0,"cell_chars":16384,"cell_head_chars":4096},"cells_cut":0,"cells_raw":0,"read":"whole","date_system":"1900"}

{"sheet":"DASHBOARD","index":0,"n_rows":5,"n_cols":4,"rows_kept":5,"cut":false,"hidden":true,"merged":[[0,0,0,14],[2,0,2,3]]}
["RUNNING DASHBOARD"]
[]
["TRAINING OVERVIEW"]
["Last Run:",{"$f":"_xlfn.MAXIFS(DATA!$B:$B,DATA!$B:$B,\"<=\"&TODAY())","v":"00:00:00"},"Distance:",{"$f":"IFERROR(INDEX(DATA!$D:$D,MATCH(B4,DATA!$B:$B,0))&\" mi\",\"-\")","v":"-"}]
["Pace:",{"$f":"IFERROR(TEXT(INDEX(DATA!$F:$F,MATCH($B$4,DATA!$B:$B,0)),\"0.00\")&\" min/mi\",\"-\")","v":"-"}]

{"sheet":"HOW TO USE","index":1,"n_rows":69,"n_cols":1,"rows_kept":69,"cut":false,"hidden":false,"merged":[[0,0,0,6],[59,0,67,0],[2,1,9,6],[11,1,17,6],[19,1,27,6],[2,0,9,0],[11,0,17,0],[19,0,27,0],[29,0,37,0],[39,0,47,0],[49,0,57,0],[68,0,68,6],[29,1,37,6],[39,1,47,6],[49,1,57,6],[59,1,67,6]]}
["HOW TO USE THIS RUNNING TRACKER"]
[]
["Getting Started"]
[]
[]
[]
[]
[]
[]
[]
[]
["Setting Up Your Race"]
[]
[]
[]
[]
[]
[]
[]
["Creating Your Training Plan"]
[]
[]
[]
[]
[]
[]
[]
[]
[]
["Logging Activities"]
[]
[]
[]
[]
[]
[]
[]
[]
[]
["Tracking Goals"]
[]
[]
[]
[]
[]
[]
[]
[]
[]
["Understanding Charts"]
[]
[]
[]
[]
[]
[]
[]
[]
[]
["Tips & Best Practices"]
[]
[]
[]
[]
[]
[]
[]
[]
["HAPPY RUNNING! YOU GOT THIS!"]

{"sheet":"TRAINING SPECS","index":2,"n_rows":32,"n_cols":13,"rows_kept":32,"cut":false,"hidden":false,"merged":[[1,0,1,3],[11,10,11,12],[16,10,16,12],[17,10,17,12],[3,1,3,2],[11,1,11,2],[15,1,15,2],[7,6,8,12],[9,6,10,8],[9,10,10,12],[11,6,11,8],[16,6,16,8],[17,6,17,8],[19,6,19,8],[23,6,23,8],[20,6,20,7],[21,6,21,7],[22,6,22,8],[19,10,19,12],[20,10,20,11],[21,10,21,11],[22,10,22,12],[23,10,23,12]]}
[]
["RACE TRAINING SPECIFICATIONS"]
[]
[null,"Race Information"]
[null,"Race Name"]
[null,"Race Date"]
[null,"Distance/Mileage"]
[null,"Location",null,null,null,null,"Utility Calculators"]
[null,"Total Elevation (ft)"]
[null,"Environment Type",null,null,null,null,"Use these!",null,null,null,"Example Uses :)"]
[]
[null,"Goal Performance",null,null,null,null,"Convert Your Goal Time to Minutes!",null,null,null,"Convert Your Goal Time to Minutes!"]
[null,"Goal Time (min)",null,null,null,null,"Hours","Minutes","Seconds",null,"Hours","Minutes","Seconds"]
[null,"Goal Pace (min/mi)",{"$f":"_xlfn.CONCAT(H30, \":\", H32, \" min/mi\")","v":{"$error":"#VALUE!"}}]
[null,null,null,null,null,null,"\\/","\\/","\\/",null,"\\/","\\/","\\/"]
[null,"Environmental Factors",null,null,null,null,{"$f":"IF(ISBLANK(G14), \"\", G14*60)","v":""},{"$f":"IF(ISBLANK(H14),\"\",H14)","v":""},{"$f":"IF(ISBLANK(I14), \"\", I14/60)","v":""},null,60,20,0.5]
[null,"Time of Year",null,null,null,null,"\\/ TOTAL MINUTES \\/",null,null,null,"\\/ TOTAL MINUTES \\/"]
[null,"Expected Temperature (°F)",null,null,null,null,{"$f":"IF(SUM(G16:I16)=0, \"use me! I like numbers that aren't 0 :)\", SUM(G16:I16))","v":"use me! I like numbers that aren't 0 :)"},null,null,null,80.5]
[null,"Location Considered"]
[null,"Altitude",null,null,null,null,"Convert Your Temperature to °F!",null,null,null,"Convert Your Temperature to °F!"]
[null,"Humidity Consideration",null,null,null,null,"Select temperature unit:",null,null,null,"Select temperature unit:"]
[null,null,null,null,null,null,"Enter temperature:",null,null,null,"Enter temperature:"]
[null,null,null,null,null,null,"\\/ Fahrenheit \\/",null,null,null,"\\/ Fahrenheit \\/"]
[null,null,null,null,null,null,{"$f":"IF(ISBLANK(I22),\"use me!\",IF($I$21=\"Fahrenheit\",_xlfn.CONCAT($I$22,\" °F\"),IF($I$21=\"Celsius\",_xlfn.CONCAT($I$22*1.8+32, \" °F\"),IF(ISBLANK(I21), \"select a unit!\", _xlfn.CONCAT(($I$22-273.15)*1.8+32,\" °F\")))))","v":"use me!"},null,null,null,32]
[]
[]
[]
[null,null,null,null,null,null,"math! Ignore me:)"]
[null,null,null,null,null,null,"minutes per mile",{"$f":"IF(ISBLANK(C7), \"\", C13/C7)","v":""}]
[null,null,null,null,null,null,"minutes (whole)",{"$f":"_xlfn.FLOOR.MATH(H29)","v":{"$error":"#VALUE!"}}]
[null,null,null,null,null,null,"seconds (decimal)",{"$f":"H29-H30","v":{"$error":"#VALUE!"}}]
[null,null,null,null,null,null,"seconds (whole)",{"$f":"ROUND(H31*60,0)","v":{"$error":"#VALUE!"}}]

{"sheet":"PLAN","index":3,"n_rows":163,"n_cols":13,"rows_kept":163,"cut":false,"hidden":false,"merged":[[132,0,138,0],[140,0,146,0],[148,0,154,0],[156,0,162,0],[2,0,2,2],[84,0,90,0],[92,0,98,0],[100,0,106,0],[108,0,114,0],[116,0,122,0],[124,0,130,0],[36,0,42,0],[44,0,50,0],[52,0,58,0],[60,0,66,0],[68,0,74,0],[76,0,82,0],[0,0,0,12],[1,0,1,2],[4,0,10,0],[12,0,18,0],[20,0,26,0],[28,0,34,0]]}
[{"$f":"IF('TRAINING SPECS'!C5=\"\", \"TRAINING PLAN\", _xlfn.CONCAT(\"TRAINING PLAN - \", 'TRAINING SPECS'!C5))","v":"TRAINING PLAN"}]
["Enter weeks of plan here ->"]
["Input start date here ->"]
["Week #","Day","Date","Run Type","Distance (mi)","Target Time","Target Pace","Notes","Nutrition/Fuel Plan","Completed?","Actual Distance","Actual Time","Actual Pace"]
[1,1,{"$f":"IF($D$3=\"\", \"input date in D3\", $D$3)","v":"input date in D3"},null,null,null,null,null,null,false]
[null,2,{"$f":"IF(ISBLANK($D$3), \"\", $D$3+B6-1)","v":""},null,null,null,null,null,null,false]
[null,3,{"$f":"IF(ISBLANK($D$3), \"\", $D$3+B7-1)","v":""},null,null,null,null,null,null,false]
[null,4,"",null,null,null,null,null,null,false]
[null,5,"",null,null,null,null,null,null,false]
[null,6,"",null,null,null,null,null,null,false]
[null,7,"",null,null,null,null,null,null,false]
[]
[2,8,{"$f":"IF(ISBLANK($D$3), \"\", $D$3+B13-1)","v":""},null,null,null,null,null,null,false]
[null,9,{"$f":"IF(ISBLANK($D$3), \"\", $D$3+B14-1)","v":""},null,null,null,null,null,null,false]
[null,10,"",null,null,null,null,null,null,false]
[null,11,"",null,null,null,null,null,null,false]
[null,12,"",null,null,null,null,null,null,false]
[null,13,"",null,null,null,null,null,null,false]
[null,14,"",null,null,null,null,null,null,false]
[]
[3,15,{"$f":"IF(ISBLANK($D$3), \"\", $D$3+B21-1)","v":""},null,null,null,null,null,null,false]
[null,16,{"$f":"IF(ISBLANK($D$3), \"\", $D$3+B22-1)","v":""},null,null,null,null,null,null,false]
[null,17,"",null,null,null,null,null,null,false]
[null,18,"",null,null,null,null,null,null,false]
[null,19,"",null,null,null,null,null,null,false]
[null,20,"",null,null,null,null,null,null,false]
[null,21,"",null,null,null,null,null,null,false]
[]
[4,22,{"$f":"IF(ISBLANK($D$3), \"\", $D$3+B29-1)","v":""},null,null,null,null,null,null,false]
[null,23,{"$f":"IF(ISBLANK($D$3), \"\", $D$3+B30-1)","v":""},null,null,null,null,null,null,false]
[null,24,"",null,null,null,null,null,null,false]
[null,25,"",null,null,null,null,null,null,false]
[null,26,"",null,null,null,null,null,null,false]
[null,27,"",null,null,null,null,null,null,false]
[null,28,"",null,null,null,null,null,null,false]
[]
[5,29,{"$f":"IF(ISBLANK($D$3), \"\", $D$3+B37-1)","v":""},null,null,null,null,null,null,false]
[null,30,{"$f":"IF(ISBLANK($D$3), \"\", $D$3+B38-1)","v":""},null,null,null,null,null,null,false]
[null,31,"",null,null,null,null,null,null,false]
[null,32,"",null,null,null,null,null,null,false]
[null,33,"",null,null,null,null,null,null,false]
[null,34,"",null,null,null,null,null,null,false]
[null,35,"",null,null,null,null,null,null,false]
[]
[6,36,{"$f":"IF(ISBLANK($D$3), \"\", $D$3+B45-1)","v":""},null,null,null,null,null,null,false]
[null,37,{"$f":"IF(ISBLANK($D$3), \"\", $D$3+B46-1)","v":""},null,null,null,null,null,null,false]
[null,38,"",null,null,null,null,null,null,false]
[null,39,"",null,null,null,null,null,null,false]
[null,40,"",null,null,null,null,null,null,false]
[null,41,"",null,null,null,null,null,null,false]
[null,42,"",null,null,null,null,null,null,false]
[]
[7,43,{"$f":"IF(ISBLANK($D$3), \"\", $D$3+B53-1)","v":""},null,null,null,null,null,null,false]
[null,44,{"$f":"IF(ISBLANK($D$3), \"\", $D$3+B54-1)","v":""},null,null,null,null,null,null,false]
[null,45,"",null,null,null,null,null,null,false]
[null,46,"",null,null,null,null,null,null,false]
[null,47,"",null,null,null,null,null,null,false]
[null,48,"",null,null,null,null,null,null,false]
[null,49,"",null,null,null,null,null,null,false]
[]
[8,50,{"$f":"IF(ISBLANK($D$3), \"\", $D$3+B61-1)","v":""},null,null,null,null,null,null,false]
[null,51,{"$f":"IF(ISBLANK($D$3), \"\", $D$3+B62-1)","v":""},null,null,null,null,null,null,false]
[null,52,"",null,null,null,null,null,null,false]
[null,53,"",null,null,null,null,null,null,false]
[null,54,"",null,null,null,null,null,null,false]
[null,55,"",null,null,null,null,null,null,false]
[null,56,"",null,null,null,null,null,null,false]
[]
[9,57,{"$f":"IF(ISBLANK($D$3), \"\", $D$3+B69-1)","v":""},null,null,null,null,null,null,false]
[null,58,{"$f":"IF(ISBLANK($D$3), \"\", $D$3+B70-1)","v":""},null,null,null,null,null,null,false]
[null,59,"",null,null,null,null,null,null,false]
[null,60,"",null,null,null,null,null,null,false]
[null,61,"",null,null,null,null,null,null,false]
[null,62,"",null,null,null,null,null,null,false]
[null,63,"",null,null,null,null,null,null,false]
[]
[10,64,{"$f":"IF(ISBLANK($D$3), \"\", $D$3+B77-1)","v":""},null,null,null,null,null,null,false]
[null,65,{"$f":"IF(ISBLANK($D$3), \"\", $D$3+B78-1)","v":""},null,null,null,null,null,null,false]
[null,66,"",null,null,null,null,null,null,false]
[null,67,"",null,null,null,null,null,null,false]
{"$rows_left_out":84}
{"sheet":"DATA","index":4,"n_rows":11,"n_cols":11,"rows_kept":11,"cut":false,"hidden":false,"merged":[[1,0,1,2]]}
[]
["*** Input Data Below (Will automatically go into table below!)"]
["Activity Name","Date","Type","Distance (mi)","Duration ([h]:mm:ss)","Pace ((mm:ss)/mi)","Elevation Gain (ft)","Heart Rate (avg)","Effort Level (1-10)","Weather","Notes"]
[]
["Click below to add!",null,null,null,"ex: 1:23:45","ex) 10:23"]
[null,null,null,null,"ex) 0:01:08"]
[]
[null,"Sort By:","Date"]
[null,"Sort Order:","Descending"]
[]
["Activity Name","Date","Type","Distance (mi)","Duration","Pace (min/mi)","Elevation Gain (ft)","Heart Rate (avg)","Effort Level (1-10)","Weather","Notes"]

{"sheet":"GOAL TRACKING","index":5,"n_rows":53,"n_cols":10,"rows_kept":53,"cut":false,"hidden":false,"merged":[[2,6,2,9],[0,0,0,9],[2,0,2,4],[13,0,13,4]]}
["GOAL TRACKING & MILESTONES"]
[]
["Goal Setup",null,null,null,null,null,"Milestones"]
[null,"Goal Name",null,null,null,null,"Milestone Name","Target Value","Date Achieved","Notes"]
[null,"Goal Number",1]
[null,"Goal Type"]
[null,"Target"]
[null,"Start Date"]
[null,"End Date"]
[null,"Current Progress"]
[null,"Percentage Complete"]
[null,"Progress Bar"]
[]
["Additional Goals"]
[null,"Goal Name"]
[null,"Goal Number",2]
[null,"Goal Type"]
[null,"Target"]
[null,"Start Date"]
[null,"End Date"]
[null,"Current Progress"]
[null,"Percentage Complete"]
[null,"Progress Bar"]
[]
[null,"Goal Name"]
[null,"Goal Number",3]
[null,"Goal Type"]
[null,"Target"]
[null,"Start Date"]
[null,"End Date"]
[null,"Current Progress"]
[null,"Percentage Complete"]
[null,"Progress Bar"]
[]
[null,"Goal Name"]
[null,"Goal Number",4]
[null,"Goal Type"]
[null,"Target"]
[null,"Start Date"]
[null,"End Date"]
[null,"Current Progress"]
[null,"Percentage Complete"]
[null,"Progress Bar"]
[]
[null,"Goal Name"]
[null,"Goal Number",5]
[null,"Goal Type"]
[null,"Target"]
[null,"Start Date"]
[null,"End Date"]
[null,"Current Progress"]
[null,"Percentage Complete"]
[null,"Progress Bar"]

{"sheet":"VISUALS","index":6,"n_rows":51,"n_cols":23,"rows_kept":51,"cut":false,"hidden":false,"merged":[[0,1,0,10]]}
[null,"GOAL TRACKING & MILESTONES",null,null,null,null,null,null,null,null,null,null,null,null,null,null,null,"Week Ending","Total Miles","Week Number",null,"Activity Type","Count"]
[null,null,null,null,null,null,null,null,null,null,null,null,null,null,null,null,null,{"$f":"TODAY()-7*(ROW()-2)","v":"2025-12-05"},{"$f":"SUMIFS(DATA!$D:$D, DATA!$B:$B, \">=\"&R2-6, DATA!$B:$B, \"<=\"&R2, DATA!$C:$C, \"Run\")","v":0},{"$f":"TEXT(R2, \"mmm dd\")","v":"Dec 05"},null,"Run",{"$f":"IF(COUNTIF(DATA!$C:$C,V2)=0, NA(), COUNTIF(DATA!$C:$C,V2))","v":{"$error":"#N/A"}}]
[null,null,null,null,null,null,null,null,null,null,null,null,null,null,null,null,null,{"$f":"TODAY()-7*(ROW()-2)","v":"2025-11-28"},{"$f":"SUMIFS(DATA!$D:$D, DATA!$B:$B, \">=\"&R3-6, DATA!$B:$B, \"<=\"&R3, DATA!$C:$C, \"Run\")","v":0},{"$f":"TEXT(R3, \"mmm dd\")","v":"Nov 28"},null,"Walk",{"$f":"IF(COUNTIF(DATA!$C:$C,V3)=0, NA(), COUNTIF(DATA!$C:$C,V3))","v":{"$error":"#N/A"}}]
[null,null,null,null,null,null,null,null,null,null,null,null,null,null,null,null,null,"2025-11-21",{"$f":"SUMIFS(DATA!$D:$D, DATA!$B:$B, \">=\"&R4-6, DATA!$B:$B, \"<=\"&R4, DATA!$C:$C, \"Run\")","v":0},"Nov 21",null,"Hike",{"$f":"IF(COUNTIF(DATA!$C:$C,V4)=0, NA(), COUNTIF(DATA!$C:$C,V4))","v":{"$error":"#N/A"}}]
[null,null,null,null,null,null,null,null,null,null,null,null,null,null,null,null,null,"2025-11-14",{"$f":"SUMIFS(DATA!$D:$D, DATA!$B:$B, \">=\"&R5-6, DATA!$B:$B, \"<=\"&R5, DATA!$C:$C, \"Run\")","v":0},"Nov 14",null,"Bike",{"$f":"IF(COUNTIF(DATA!$C:$C,V5)=0, NA(), COUNTIF(DATA!$C:$C,V5))","v":{"$error":"#N/A"}}]
[null,null,null,null,null,null,null,null,null,null,null,null,null,null,null,null,null,"2025-11-07",{"$f":"SUMIFS(DATA!$D:$D, DATA!$B:$B, \">=\"&R6-6, DATA!$B:$B, \"<=\"&R6, DATA!$C:$C, \"Run\")","v":0},"Nov 07",null,"Weight Training",{"$f":"IF(COUNTIF(DATA!$C:$C,V6)=0, NA(), COUNTIF(DATA!$C:$C,V6))","v":{"$error":"#N/A"}}]
[null,null,null,null,null,null,null,null,null,null,null,null,null,null,null,null,null,"2025-10-31",{"$f":"SUMIFS(DATA!$D:$D, DATA!$B:$B, \">=\"&R7-6, DATA!$B:$B, \"<=\"&R7, DATA!$C:$C, \"Run\")","v":0},"Oct 31",null,"Yoga",{"$f":"IF(COUNTIF(DATA!$C:$C,V7)=0, NA(), COUNTIF(DATA!$C:$C,V7))","v":{"$error":"#N/A"}}]
[null,null,null,null,null,null,null,null,null,null,null,null,null,null,null,null,null,"2025-10-24",{"$f":"SUMIFS(DATA!$D:$D, DATA!$B:$B, \">=\"&R8-6, DATA!$B:$B, \"<=\"&R8, DATA!$C:$C, \"Run\")","v":0},"Oct 24",null,"Swimming",{"$f":"IF(COUNTIF(DATA!$C:$C,V8)=0, NA(), COUNTIF(DATA!$C:$C,V8))","v":{"$error":"#N/A"}}]
[null,null,null,null,null,null,null,null,null,null,null,null,null,null,null,null,null,"2025-10-17",{"$f":"SUMIFS(DATA!$D:$D, DATA!$B:$B, \">=\"&R9-6, DATA!$B:$B, \"<=\"&R9, DATA!$C:$C, \"Run\")","v":0},"Oct 17",null,"Other",{"$f":"IF(COUNTIF(DATA!$C:$C,V9)=0, NA(), COUNTIF(DATA!$C:$C,V9))","v":{"$error":"#N/A"}}]
[null,null,null,null,null,null,null,null,null,null,null,null,null,null,null,null,null,"2025-10-10",{"$f":"SUMIFS(DATA!$D:$D, DATA!$B:$B, \">=\"&R10-6, DATA!$B:$B, \"<=\"&R10, DATA!$C:$C, \"Run\")","v":0},"Oct 10"]
[null,null,null,null,null,null,null,null,null,null,null,null,null,null,null,null,null,"2025-10-03",{"$f":"SUMIFS(DATA!$D:$D, DATA!$B:$B, \">=\"&R11-6, DATA!$B:$B, \"<=\"&R11, DATA!$C:$C, \"Run\")","v":0},"Oct 03"]
[null,null,null,null,null,null,null,null,null,null,null,null,null,null,null,null,null,"2025-09-26",{"$f":"SUMIFS(DATA!$D:$D, DATA!$B:$B, \">=\"&R12-6, DATA!$B:$B, \"<=\"&R12, DATA!$C:$C, \"Run\")","v":0},"Sep 26"]
[null,null,null,null,null,null,null,null,null,null,null,null,null,null,null,null,null,"2025-09-19",{"$f":"SUMIFS(DATA!$D:$D, DATA!$B:$B, \">=\"&R13-6, DATA!$B:$B, \"<=\"&R13, DATA!$C:$C, \"Run\")","v":0},"Sep 19"]
[]
[]
[null,null,null,null,null,null,null,null,null,null,null,null,null,null,null,null,null,"Date","Average Pace",null,"Dynamic Date","Dynamic Average Pace"]
[null,null,null,null,null,null,null,null,null,null,null,null,null,null,null,null,null,{"$f":"TODAY()-7*(ROW()-17)","v":"2025-12-05"},{"$f":"IF(COUNTIFS(DATA!$B:$B, \">=\"&R17-6, DATA!$B:$B, \"<=\"&R17, DATA!$C:$C, \"Run\")=0, NA(), AVERAGEIFS(DATA!$F:$F, DATA!$B:$B, \">=\"&R17-6, DATA!$B:$B, \"<=\"&R17, DATA!$C:$C, \"Run\"))","v":{"$error":"#N/A"}},null,{"$f":"_xlfn._xlws.FILTER(R17:R28, NOT(ISNA(S17:S28)))","v":{"$error":"#VALUE!"}},{"$f":"_xlfn._xlws.FILTER(S17:S28, NOT(ISNA(S17:S28)))","v":{"$error":"#VALUE!"}}]
[null,null,null,null,null,null,null,null,null,null,null,null,null,null,null,null,null,{"$f":"TODAY()-7*(ROW()-17)","v":"2025-11-28"},{"$f":"IF(COUNTIFS(DATA!$B:$B, \">=\"&R18-6, DATA!$B:$B, \"<=\"&R18, DATA!$C:$C, \"Run\")=0, NA(), AVERAGEIFS(DATA!$F:$F, DATA!$B:$B, \">=\"&R18-6, DATA!$B:$B, \"<=\"&R18, DATA!$C:$C, \"Run\"))","v":{"$error":"#N/A"}}]
[null,null,null,null,null,null,null,null,null,null,null,null,null,null,null,null,null,"2025-11-21",{"$f":"IF(COUNTIFS(DATA!$B:$B, \">=\"&R19-6, DATA!$B:$B, \"<=\"&R19, DATA!$C:$C, \"Run\")=0, NA(), AVERAGEIFS(DATA!$F:$F, DATA!$B:$B, \">=\"&R19-6, DATA!$B:$B, \"<=\"&R19, DATA!$C:$C, \"Run\"))","v":{"$error":"#N/A"}}]
[null,null,null,null,null,null,null,null,null,null,null,null,null,null,null,null,null,"2025-11-14",{"$f":"IF(COUNTIFS(DATA!$B:$B, \">=\"&R20-6, DATA!$B:$B, \"<=\"&R20, DATA!$C:$C, \"Run\")=0, NA(), AVERAGEIFS(DATA!$F:$F, DATA!$B:$B, \">=\"&R20-6, DATA!$B:$B, \"<=\"&R20, DATA!$C:$C, \"Run\"))","v":{"$error":"#N/A"}}]
[null,null,null,null,null,null,null,null,null,null,null,null,null,null,null,null,null,"2025-11-07",{"$f":"IF(COUNTIFS(DATA!$B:$B, \">=\"&R21-6, DATA!$B:$B, \"<=\"&R21, DATA!$C:$C, \"Run\")=0, NA(), AVERAGEIFS(DATA!$F:$F, DATA!$B:$B, \">=\"&R21-6, DATA!$B:$B, \"<=\"&R21, DATA!$C:$C, \"Run\"))","v":{"$error":"#N/A"}}]
[null,null,null,null,null,null,null,null,null,null,null,null,null,null,null,null,null,"2025-10-31",{"$f":"IF(COUNTIFS(DATA!$B:$B, \">=\"&R22-6, DATA!$B:$B, \"<=\"&R22, DATA!$C:$C, \"Run\")=0, NA(), AVERAGEIFS(DATA!$F:$F, DATA!$B:$B, \">=\"&R22-6, DATA!$B:$B, \"<=\"&R22, DATA!$C:$C, \"Run\"))","v":{"$error":"#N/A"}}]
[null,null,null,null,null,null,null,null,null,null,null,null,null,null,null,null,null,"2025-10-24",{"$f":"IF(COUNTIFS(DATA!$B:$B, \">=\"&R23-6, DATA!$B:$B, \"<=\"&R23, DATA!$C:$C, \"Run\")=0, NA(), AVERAGEIFS(DATA!$F:$F, DATA!$B:$B, \">=\"&R23-6, DATA!$B:$B, \"<=\"&R23, DATA!$C:$C, \"Run\"))","v":{"$error":"#N/A"}}]
[null,null,null,null,null,null,null,null,null,null,null,null,null,null,null,null,null,"2025-10-17",{"$f":"IF(COUNTIFS(DATA!$B:$B, \">=\"&R24-6, DATA!$B:$B, \"<=\"&R24, DATA!$C:$C, \"Run\")=0, NA(), AVERAGEIFS(DATA!$F:$F, DATA!$B:$B, \">=\"&R24-6, DATA!$B:$B, \"<=\"&R24, DATA!$C:$C, \"Run\"))","v":{"$error":"#N/A"}}]
[null,null,null,null,null,null,null,null,null,null,null,null,null,null,null,null,null,"2025-10-10",{"$f":"IF(COUNTIFS(DATA!$B:$B, \">=\"&R25-6, DATA!$B:$B, \"<=\"&R25, DATA!$C:$C, \"Run\")=0, NA(), AVERAGEIFS(DATA!$F:$F, DATA!$B:$B, \">=\"&R25-6, DATA!$B:$B, \"<=\"&R25, DATA!$C:$C, \"Run\"))","v":{"$error":"#N/A"}}]
[null,null,null,null,null,null,null,null,null,null,null,null,null,null,null,null,null,"2025-10-03",{"$f":"IF(COUNTIFS(DATA!$B:$B, \">=\"&R26-6, DATA!$B:$B, \"<=\"&R26, DATA!$C:$C, \"Run\")=0, NA(), AVERAGEIFS(DATA!$F:$F, DATA!$B:$B, \">=\"&R26-6, DATA!$B:$B, \"<=\"&R26, DATA!$C:$C, \"Run\"))","v":{"$error":"#N/A"}}]
[null,null,null,null,null,null,null,null,null,null,null,null,null,null,null,null,null,"2025-09-26",{"$f":"IF(COUNTIFS(DATA!$B:$B, \">=\"&R27-6, DATA!$B:$B, \"<=\"&R27, DATA!$C:$C, \"Run\")=0, NA(), AVERAGEIFS(DATA!$F:$F, DATA!$B:$B, \">=\"&R27-6, DATA!$B:$B, \"<=\"&R27, DATA!$C:$C, \"Run\"))","v":{"$error":"#N/A"}}]
[null,null,null,null,null,null,null,null,null,null,null,null,null,null,null,null,null,"2025-09-19",{"$f":"IF(COUNTIFS(DATA!$B:$B, \">=\"&R28-6, DATA!$B:$B, \"<=\"&R28, DATA!$C:$C, \"Run\")=0, NA(), AVERAGEIFS(DATA!$F:$F, DATA!$B:$B, \">=\"&R28-6, DATA!$B:$B, \"<=\"&R28, DATA!$C:$C, \"Run\"))","v":{"$error":"#N/A"}}]
[]
[null,null,null,null,null,null,null,null,null,null,null,null,null,null,null,null,null,"Month","Total Miles"]
[null,null,null,null,null,null,null,null,null,null,null,null,null,null,null,null,null,{"$f":"TEXT(DATE(YEAR(TODAY()),MONTH(TODAY())-ROW()+31,1),\"mmm yyyy\")","v":"Dec 2025"},{"$f":"SUMIFS(DATA!$D:$D, DATA!$B:$B, \">=\"&DATE(YEAR(TODAY()),MONTH(TODAY())-ROW()+31,1), DATA!$B:$B, \"<\"&DATE(YEAR(TODAY()),MONTH(TODAY())-ROW()+32,1), DATA!$C:$C, \"Run\")","v":0}]
[null,null,null,null,null,null,null,null,null,null,null,null,null,null,null,null,null,{"$f":"TEXT(DATE(YEAR(TODAY()),MONTH(TODAY())-ROW()+31,1),\"mmm yyyy\")","v":"Nov 2025"},{"$f":"SUMIFS(DATA!$D:$D, DATA!$B:$B, \">=\"&DATE(YEAR(TODAY()),MONTH(TODAY())-ROW()+31,1), DATA!$B:$B, \"<\"&DATE(YEAR(TODAY()),MONTH(TODAY())-ROW()+32,1), DATA!$C:$C, \"Run\")","v":0}]
[null,null,null,null,null,null,null,null,null,null,null,null,null,null,null,null,null,"Oct 2025",{"$f":"SUMIFS(DATA!$D:$D, DATA!$B:$B, \">=\"&DATE(YEAR(TODAY()),MONTH(TODAY())-ROW()+31,1), DATA!$B:$B, \"<\"&DATE(YEAR(TODAY()),MONTH(TODAY())-ROW()+32,1), DATA!$C:$C, \"Run\")","v":0}]
[null,null,null,null,null,null,null,null,null,null,null,null,null,null,null,null,null,"Sep 2025",{"$f":"SUMIFS(DATA!$D:$D, DATA!$B:$B, \">=\"&DATE(YEAR(TODAY()),MONTH(TODAY())-ROW()+31,1), DATA!$B:$B, \"<\"&DATE(YEAR(TODAY()),MONTH(TODAY())-ROW()+32,1), DATA!$C:$C, \"Run\")","v":0}]
[null,null,null,null,null,null,null,null,null,null,null,null,null,null,null,null,null,"Aug 2025",{"$f":"SUMIFS(DATA!$D:$D, DATA!$B:$B, \">=\"&DATE(YEAR(TODAY()),MONTH(TODAY())-ROW()+31,1), DATA!$B:$B, \"<\"&DATE(YEAR(TODAY()),MONTH(TODAY())-ROW()+32,1), DATA!$C:$C, \"Run\")","v":0}]
[null,null,null,null,null,null,null,null,null,null,null,null,null,null,null,null,null,"Jul 2025",{"$f":"SUMIFS(DATA!$D:$D, DATA!$B:$B, \">=\"&DATE(YEAR(TODAY()),MONTH(TODAY())-ROW()+31,1), DATA!$B:$B, \"<\"&DATE(YEAR(TODAY()),MONTH(TODAY())-ROW()+32,1), DATA!$C:$C, \"Run\")","v":0}]
[]
[]
[null,null,null,null,null,null,null,null,null,null,null,null,null,null,null,null,null,"Week Ending","Total Elevation (ft)",null,null,"Effort Level","Count"]
[null,null,null,null,null,null,null,null,null,null,null,null,null,null,null,null,null,{"$f":"TODAY()-7*(ROW()-40)","v":"2025-12-05"},{"$f":"SUMIFS(DATA!$G:$G, DATA!$B:$B, \">=\"&R40-6, DATA!$B:$B, \"<=\"&R40, DATA!$C:$C, \"Run\")","v":0},null,null,1,{"$f":"COUNTIF(DATA!$I:$I,V40)","v":0}]
[null,null,null,null,null,null,null,null,null,null,null,null,null,null,null,null,null,{"$f":"TODAY()-7*(ROW()-40)","v":"2025-11-28"},{"$f":"SUMIFS(DATA!$G:$G, DATA!$B:$B, \">=\"&R41-6, DATA!$B:$B, \"<=\"&R41, DATA!$C:$C, \"Run\")","v":0},null,null,2,{"$f":"COUNTIF(DATA!$I:$I,V41)","v":0}]
[null,null,null,null,null,null,null,null,null,null,null,null,null,null,null,null,null,"2025-11-21",{"$f":"SUMIFS(DATA!$G:$G, DATA!$B:$B, \">=\"&R42-6, DATA!$B:$B, \"<=\"&R42, DATA!$C:$C, \"Run\")","v":0},null,null,3,{"$f":"COUNTIF(DATA!$I:$I,V42)","v":0}]
[null,null,null,null,null,null,null,null,null,null,null,null,null,null,null,null,null,"2025-11-14",{"$f":"SUMIFS(DATA!$G:$G, DATA!$B:$B, \">=\"&R43-6, DATA!$B:$B, \"<=\"&R43, DATA!$C:$C, \"Run\")","v":0},null,null,4,{"$f":"COUNTIF(DATA!$I:$I,V43)","v":0}]
[null,null,null,null,null,null,null,null,null,null,null,null,null,null,null,null,null,"2025-11-07",{"$f":"SUMIFS(DATA!$G:$G, DATA!$B:$B, \">=\"&R44-6, DATA!$B:$B, \"<=\"&R44, DATA!$C:$C, \"Run\")","v":0},null,null,5,{"$f":"COUNTIF(DATA!$I:$I,V44)","v":0}]
[null,null,null,null,null,null,null,null,null,null,null,null,null,null,null,null,null,"2025-10-31",{"$f":"SUMIFS(DATA!$G:$G, DATA!$B:$B, \">=\"&R45-6, DATA!$B:$B, \"<=\"&R45, DATA!$C:$C, \"Run\")","v":0},null,null,6,{"$f":"COUNTIF(DATA!$I:$I,V45)","v":0}]
[null,null,null,null,null,null,null,null,null,null,null,null,null,null,null,null,null,"2025-10-24",{"$f":"SUMIFS(DATA!$G:$G, DATA!$B:$B, \">=\"&R46-6, DATA!$B:$B, \"<=\"&R46, DATA!$C:$C, \"Run\")","v":0},null,null,7,{"$f":"COUNTIF(DATA!$I:$I,V46)","v":0}]
[null,null,null,null,null,null,null,null,null,null,null,null,null,null,null,null,null,"2025-10-17",{"$f":"SUMIFS(DATA!$G:$G, DATA!$B:$B, \">=\"&R47-6, DATA!$B:$B, \"<=\"&R47, DATA!$C:$C, \"Run\")","v":0},null,null,8,{"$f":"COUNTIF(DATA!$I:$I,V47)","v":0}]
[null,null,null,null,null,null,null,null,null,null,null,null,null,null,null,null,null,"2025-10-10",{"$f":"SUMIFS(DATA!$G:$G, DATA!$B:$B, \">=\"&R48-6, DATA!$B:$B, \"<=\"&R48, DATA!$C:$C, \"Run\")","v":0},null,null,9,{"$f":"COUNTIF(DATA!$I:$I,V48)","v":0}]
[null,null,null,null,null,null,null,null,null,null,null,null,null,null,null,null,null,"2025-10-03",{"$f":"SUMIFS(DATA!$G:$G, DATA!$B:$B, \">=\"&R49-6, DATA!$B:$B, \"<=\"&R49, DATA!$C:$C, \"Run\")","v":0},null,null,10,{"$f":"COUNTIF(DATA!$I:$I,V49)","v":0}]
[null,null,null,null,null,null,null,null,null,null,null,null,null,null,null,null,null,"2025-09-26",{"$f":"SUMIFS(DATA!$G:$G, DATA!$B:$B, \">=\"&R50-6, DATA!$B:$B, \"<=\"&R50, DATA!$C:$C, \"Run\")","v":0}]
[null,null,null,null,null,null,null,null,null,null,null,null,null,null,null,null,null,"2025-09-19",{"$f":"SUMIFS(DATA!$G:$G, DATA!$B:$B, \">=\"&R51-6, DATA!$B:$B, \"<=\"&R51, DATA!$C:$C, \"Run\")","v":0}]